BDBM50041340 1-[4-(2-Chloro-benzenesulfonylaminocarbonyl)-2-methoxy-benzyl]-1H-indole-6-carboxylic acid (4,4,4-trifluoro-2-methyl-butyl)-amide::CHEMBL285300
SMILES COc1cc(ccc1Cn1ccc2ccc(cc12)C(=O)NCC(C)CC(F)(F)F)C(=O)NS(=O)(=O)c1ccccc1Cl
InChI Key InChIKey=PWAGAAFAALAOJP-UHFFFAOYSA-N
Data  1 KI
  Tab Delimited (TSV)   2D SDfile   Computed 3D by Vconf -m prep SDfile
Find this compound or compounds like it in BindingDB:
Activity Spreadsheet -- Enzyme Inhibition Constant Data from BindingDB
Found 1 hit for monomerid = 50041340
TargetCysteinyl leukotriene receptor 1(GUINEA PIG)
Zeneca Pharmaceuticals Group
Curated by ChEMBL
LigandPNGBDBM50041340(1-[4-(2-Chloro-benzenesulfonylaminocarbonyl)-2-met...)
Affinity DataKi:  4.20nM. Assay description: Inhibition constant for displacement of [3H]-LTD4 on guinea pig lung parenchymal membranes
In DepthDetails ArticlePubMed