BDBM50041359 3-[2-Methoxy-4-(toluene-2-sulfonylaminocarbonyl)-benzyl]-1-methyl-1H-indole-5-carboxylic acid (3,3,3-trifluoro-2-methyl-propyl)-amide::CHEMBL287302
SMILES COc1cc(ccc1Cc1cn(C)c2ccc(cc12)C(=O)NCC(C)C(F)(F)F)C(=O)NS(=O)(=O)c1ccccc1C
InChI Key InChIKey=VVGANXHBCWYQMJ-UHFFFAOYSA-N
Data  1 KI
  Tab Delimited (TSV)   2D SDfile   Computed 3D by Vconf -m prep SDfile
Find this compound or compounds like it in BindingDB:
Activity Spreadsheet -- Enzyme Inhibition Constant Data from BindingDB
Found 1 hit for monomerid = 50041359
TargetCysteinyl leukotriene receptor 1(GUINEA PIG)
Zeneca Pharmaceuticals Group
Curated by ChEMBL
LigandPNGBDBM50041359(3-[2-Methoxy-4-(toluene-2-sulfonylaminocarbonyl)-b...)
Affinity DataKi:  12nM. Assay description: Inhibition constant for displacement of [3H]-LTD4 on guinea pig lung parenchymal membranes
In DepthDetails ArticlePubMed