BDBM50041416 CHEMBL3356404
SMILES CC(C)CC(=O)Oc1cccc(CC(=O)N2CCNc3nc(ccc3[C@H]2CC(O)=O)C(F)(F)F)c1
InChI Key InChIKey=CJLZUKCACMUYFP-GOSISDBHSA-N
Data  2 EC50
  Tab Delimited (TSV)   2D SDfile   Computed 3D by Vconf -m prep SDfile
Find this compound or compounds like it in BindingDB:
Activity Spreadsheet -- Enzyme Inhibition Constant Data from BindingDB
Found 2 hits for monomerid = 50041416
TargetBombesin receptor subtype-3(Mus musculus)
Daiichi Sankyo
Curated by ChEMBL
LigandPNGBDBM50041416(CHEMBL3356404)
Affinity DataEC50:  43nM. Assay description: Agonist activity at mouse BRS3 expressed in CHO-K1 cells by IP-One HTRF assay
In DepthDetails ArticlePubMed
TargetBombesin receptor subtype-3(Homo sapiens (Human))
Daiichi Sankyo
Curated by ChEMBL
LigandPNGBDBM50041416(CHEMBL3356404)
Affinity DataEC50:  12nM. Assay description: Agonist activity at human BRS3 expressed in CHO-K1 cells by IP-One HTRF assay
In DepthDetails ArticlePubMed