BDBM50041418 CHEMBL3356406
SMILES OC(=O)C[C@H]1N(CCNc2nc(ccc12)C(F)(F)F)C(=O)Cc1cccc(OC(=O)CC2CC2)c1
InChI Key InChIKey=CGQOANXOCNXBEZ-GOSISDBHSA-N
Data  2 EC50
  Tab Delimited (TSV)   2D SDfile   Computed 3D by Vconf -m prep SDfile
Find this compound or compounds like it in BindingDB:
Activity Spreadsheet -- Enzyme Inhibition Constant Data from BindingDB
Found 2 hits for monomerid = 50041418
TargetBombesin receptor subtype-3(Mus musculus)
Daiichi Sankyo
Curated by ChEMBL
LigandPNGBDBM50041418(CHEMBL3356406)
Affinity DataEC50:  81nM. Assay description: Agonist activity at mouse BRS3 expressed in CHO-K1 cells by IP-One HTRF assay
In DepthDetails ArticlePubMed
TargetBombesin receptor subtype-3(Homo sapiens (Human))
Daiichi Sankyo
Curated by ChEMBL
LigandPNGBDBM50041418(CHEMBL3356406)
Affinity DataEC50:  42nM. Assay description: Agonist activity at human BRS3 expressed in CHO-K1 cells by IP-One HTRF assay
In DepthDetails ArticlePubMed