BDBM50041529 CHEMBL3358391
SMILES Brc1ccncc1NC(=O)c1cccc(c1)-c1ccc2ccccc2c1
InChI Key InChIKey=CPSPDZNAUKTMPS-UHFFFAOYSA-N
Data  4 IC50
  Tab Delimited (TSV)   2D SDfile   Computed 3D by Vconf -m prep SDfile
Find this compound or compounds like it in BindingDB:
Activity Spreadsheet -- Enzyme Inhibition Constant Data from BindingDB
Found 4 hits for monomerid = 50041529
TargetNAD-dependent protein deacetylase sirtuin-2(Homo sapiens (Human))
The University Of Tokyo
Curated by ChEMBL
LigandPNGBDBM50041529(CHEMBL3358391)
Affinity DataIC50:  600nM. Assay description: Inhibition of GST-tagged human recombinant SIRT2 (34 to 356 residues) expressed in Escherichia coli BL21 using Fluor de Lys-SIRT as substrate incubat...
In DepthDetails ArticlePubMed
TargetNAD-dependent protein deacetylase sirtuin-2(Homo sapiens (Human))
The University Of Tokyo
Curated by ChEMBL
LigandPNGBDBM50041529(CHEMBL3358391)
Affinity DataIC50:  600nM. Assay description: Inhibition of sirtuin 2 (unknown origin)
In DepthDetails ArticlePubMed
TargetNAD-dependent protein deacetylase sirtuin-3, mitochondrial(Homo sapiens (Human))
The University Of Tokyo
Curated by ChEMBL
LigandPNGBDBM50041529(CHEMBL3358391)
Affinity DataIC50: >1.00E+5nM. Assay description: Inhibition of human recombinant SIRT3 using Fluor de Lys-SIRT as substrate incubated for 60 mins prior to substrate addition measured after 45 mins b...
In DepthDetails ArticlePubMed
TargetNAD-dependent protein deacetylase sirtuin-1(Homo sapiens (Human))
The University Of Tokyo
Curated by ChEMBL
LigandPNGBDBM50041529(CHEMBL3358391)
Affinity DataIC50: >1.00E+5nM. Assay description: Inhibition of human recombinant SIRT1 using Fluor de Lys-SIRT as substrate incubated for 60 mins prior to substrate addition measured after 45 mins b...
In DepthDetails ArticlePubMed