BDBM50041553 CHEMBL3358416
SMILES FC(F)(F)c1cnc(CNC(=O)c2ccc3N(C(C4CC4)C4(CCS(=O)(=O)CC4)c3c2)S(=O)(=O)c2ccc(Cl)cc2)c(Cl)c1
InChI Key InChIKey=JJFUUZACIBZWST-UHFFFAOYSA-N
Data  2 IC50
  Tab Delimited (TSV)   2D SDfile   Computed 3D by Vconf -m prep SDfile
Find this compound or compounds like it in BindingDB:
Activity Spreadsheet -- Enzyme Inhibition Constant Data from BindingDB
Found 2 hits for monomerid = 50041553
TargetGonadotropin-releasing hormone receptor(Homo sapiens (Human))
Therachem Research Medilab (India)
Curated by ChEMBL
LigandPNGBDBM50041553(CHEMBL3358416)
Affinity DataIC50:  9.35E+3nM. Assay description: Antagonist activity against human GnRH receptor expressed in CHO cells by IP-one HTRF assay
In DepthDetails ArticlePubMed
TargetGonadotropin-releasing hormone receptor(Homo sapiens (Human))
Therachem Research Medilab (India)
Curated by ChEMBL
LigandPNGBDBM50041553(CHEMBL3358416)
Affinity DataIC50:  9.35E+3nM. Assay description: Antagonist activity against human GnRH receptor expressed in CHO cells by IP-one HTRF assay
In DepthDetails ArticlePubMed