BDBM50041610 CHEMBL3358436
SMILES CCn1nccc1Oc1cc(CC2CCOCC2)cnc1NC(=O)NC
InChI Key InChIKey=NLQRZZOZBUYIOK-UHFFFAOYSA-N
Data  1 EC50
  Tab Delimited (TSV)   2D SDfile   Computed 3D by Vconf -m prep SDfile
Find this compound or compounds like it in BindingDB:
Activity Spreadsheet -- Enzyme Inhibition Constant Data from BindingDB
Found 1 hit for monomerid = 50041610
TargetHexokinase-4(Homo sapiens (Human))
Amgen
Curated by ChEMBL
LigandPNGBDBM50041610(CHEMBL3358436)
Affinity DataEC50:  350nM. Assay description: Activation of human recombinant Glucokinase measured over 5 mins by G6-PD coupled assay in presence of 5 mM glucose
In DepthDetails ArticlePubMed