BDBM50041630 (2S,5R)-8-(2-Fluoro-ethyl)-3-(4-iodo-phenyl)-8-aza-bicyclo[3.2.1]octane-2-carboxylic acid methyl ester::CHEMBL41966
SMILES COC(=O)[C@@H]1C2CC[C@H](CC1c1ccc(I)cc1)N2CCF
InChI Key InChIKey=CCWXJQJFBKJFEZ-LMPOIIKSSA-N
Data  1 KI
  Tab Delimited (TSV)   2D SDfile   Computed 3D by Vconf -m prep SDfile
Find this compound or compounds like it in BindingDB:
Activity Spreadsheet -- Enzyme Inhibition Constant Data from BindingDB
Found 1 hit for monomerid = 50041630
TargetSodium-dependent dopamine transporter(Rattus norvegicus (rat))
Research Biochemicals International
Curated by ChEMBL
LigandPNGBDBM50041630((2S,5R)-8-(2-Fluoro-ethyl)-3-(4-iodo-phenyl)-8-aza...)
Affinity DataKi:  4nM. Assay description: Binding affinity for dopamine transporters in rat brain tissue.
In DepthDetails ArticlePubMed