BDBM50041823 3-Cyclopentyloxy-N-(2,5-dichloro-phenyl)-4-methoxy-benzamide::CHEMBL44673
SMILES COc1ccc(cc1OC1CCCC1)C(=O)Nc1cc(Cl)ccc1Cl
InChI Key InChIKey=KWIMJLNXOSUSHU-UHFFFAOYSA-N
Data  2 IC50
  Tab Delimited (TSV)   2D SDfile   Computed 3D by Vconf -m prep SDfile
Find this compound or compounds like it in BindingDB:
Activity Spreadsheet -- Enzyme Inhibition Constant Data from BindingDB
Found 2 hits for monomerid = 50041823
Target3',5'-cyclic-AMP phosphodiesterase(Sus scrofa)
RhôNe-Poulenc Rorer
Curated by ChEMBL
LigandPNGBDBM50041823(3-Cyclopentyloxy-N-(2,5-dichloro-phenyl)-4-methoxy...)
Affinity DataIC50:  500nM. Assay description: Inhibitory potency against pig aortic PDE IV
In DepthDetails ArticlePubMed
TargetcGMP-specific 3',5'-cyclic phosphodiesterase(Homo sapiens (Human))
RhôNe-Poulenc Rorer
Curated by ChEMBL
LigandPNGBDBM50041823(3-Cyclopentyloxy-N-(2,5-dichloro-phenyl)-4-methoxy...)
Affinity DataIC50: >2.00E+5nM. Assay description: Inhibitory potency against pig aortic PDE V.
In DepthDetails ArticlePubMed