BDBM50041844 3-(cyclopentyloxy)-N-(2,6-difluorophenyl)-4-methoxybenzamide::3-Cyclopentyloxy-N-(2,6-difluoro-phenyl)-4-methoxy-benzamide::CHEMBL47113
SMILES COc1ccc(cc1OC1CCCC1)C(=O)Nc1c(F)cccc1F
InChI Key InChIKey=XQZMYDIWLZMXHX-UHFFFAOYSA-N
Data  3 IC50
  Tab Delimited (TSV)   2D SDfile   Computed 3D by Vconf -m prep SDfile
Find this compound or compounds like it in BindingDB:
Activity Spreadsheet -- Enzyme Inhibition Constant Data from BindingDB
Found 3 hits for monomerid = 50041844
TargetcGMP-specific 3',5'-cyclic phosphodiesterase(Homo sapiens (Human))
RhôNe-Poulenc Rorer
Curated by ChEMBL
LigandPNGBDBM50041844(3-(cyclopentyloxy)-N-(2,6-difluorophenyl)-4-methox...)
Affinity DataIC50: >1.00E+6nM. Assay description: Inhibitory potency against pig aortic PDE V.
In DepthDetails ArticlePubMed
TargetcAMP-specific 3',5'-cyclic phosphodiesterase 4D(Homo sapiens (Human))
Georgia State University
Curated by ChEMBL
LigandPNGBDBM50041844(3-(cyclopentyloxy)-N-(2,6-difluorophenyl)-4-methox...)
Affinity DataIC50:  71nM. Assay description: Inhibition of full length human PDE4D2 expressed in Escherichia coli BL21 by liquid scintillation counting
In DepthDetails ArticlePubMed
Target3',5'-cyclic-AMP phosphodiesterase(Sus scrofa)
RhôNe-Poulenc Rorer
Curated by ChEMBL
LigandPNGBDBM50041844(3-(cyclopentyloxy)-N-(2,6-difluorophenyl)-4-methox...)
Affinity DataIC50:  70nM. Assay description: Inhibitory potency against pig aortic PDE IV
In DepthDetails ArticlePubMed