BDBM50042268 4'-(4-Oxo-1,3-diaza-spiro[4.4]non-1-en-3-ylmethyl)-biphenyl-2-carboxylic acid::CHEMBL115937
SMILES OC(=O)c1ccccc1-c1ccc(CN2C=NC3(CCCC3)C2=O)cc1
InChI Key InChIKey=UNTVEUKERKKKGW-UHFFFAOYSA-N
Data  1 IC50
  Tab Delimited (TSV)   2D SDfile   Computed 3D by Vconf -m prep SDfile
Find this compound or compounds like it in BindingDB:
Activity Spreadsheet -- Enzyme Inhibition Constant Data from BindingDB
Found 1 hit for monomerid = 50042268
TargetType-1 angiotensin II receptor B(RAT)
Sanofi Recherche
Curated by ChEMBL
LigandPNGBDBM50042268(4'-(4-Oxo-1,3-diaza-spiro[4.4]non-1-en-3-ylmethyl)...)
Affinity DataIC50: >1.00E+4nM. Assay description: Binding affinity for Angiotensin II receptor, type 1 measured by ability to displace [125I]- A II from its specific binding site in rat liver membran...
In DepthDetails ArticlePubMed