BDBM50042370 CHEMBL326595::[3-(2-Amino-6-oxo-1,6-dihydro-purin-9-ylmethyl)-benzyloxymethyl]-phosphonic acid
SMILES Nc1nc2n(Cc3cccc(COCP(O)(O)=O)c3)cnc2c(=O)[nH]1
InChI Key InChIKey=NARPDSYSVOSIAJ-UHFFFAOYSA-N
Data  1 KI
  Tab Delimited (TSV)   2D SDfile   Computed 3D by Vconf -m prep SDfile
Find this compound or compounds like it in BindingDB:
Activity Spreadsheet -- Enzyme Inhibition Constant Data from BindingDB
Found 1 hit for monomerid = 50042370
TargetPurine nucleoside phosphorylase(Homo sapiens (Human))
Burroughs Wellcome
Curated by ChEMBL
LigandPNGBDBM50042370(CHEMBL326595 | [3-(2-Amino-6-oxo-1,6-dihydro-purin...)
Affinity DataKi:  5.80nM. Assay description: Inhibition of purine nucleoside phosphorylase of human erythrocytes in xanthine oxidase-coupled assay
In DepthDetails ArticlePubMed