BDBM50042540 5-Butyl-4-[2'-(1H-tetrazol-5-yl)-biphenyl-4-ylmethyl]-2-(2-trifluoromethyl-phenyl)-2H-pyrazole-3-carboxylic acid ethyl ester::CHEMBL327862
SMILES CCCCc1nn(c(C(=O)OCC)c1Cc1ccc(cc1)-c1ccccc1-c1nnn[nH]1)-c1ccccc1C(F)(F)F
InChI Key InChIKey=MAJVEPABMWEJIP-UHFFFAOYSA-N
Data  3 IC50
  Tab Delimited (TSV)   2D SDfile   Computed 3D by Vconf -m prep SDfile
Find this compound or compounds like it in BindingDB:
Activity Spreadsheet -- Enzyme Inhibition Constant Data from BindingDB
Found 3 hits for monomerid = 50042540
TargetBeta-lactamase(Pseudomonas aeruginosa)
Merck Research Laboratories
Curated by ChEMBL
LigandPNGBDBM50042540(5-Butyl-4-[2'-(1H-tetrazol-5-yl)-biphenyl-4-ylmeth...)
Affinity DataIC50: >2.00E+5nM. Assay description: Inhibition of metallo-beta-lactamase (MBL) from Pseudomonas aeruginosa mediated by the plasmid-borne IMP-1 enzyme.
In DepthDetails ArticlePubMed
TargetType-1 angiotensin II receptor(RABBIT)
Merck Research Laboratories
Curated by ChEMBL
LigandPNGBDBM50042540(5-Butyl-4-[2'-(1H-tetrazol-5-yl)-biphenyl-4-ylmeth...)
Affinity DataIC50:  21nM. Assay description: Evaluation of Angiotensin II antagonistic activity by displacement of [125I]-Sar Ile-AII at the rabbit aorta Angiotensin II receptor, type 1
In DepthDetails ArticlePubMed
TargetMetallo-beta-lactamase type 2(Bacteroides fragilis)
Merck Research Laboratories
Curated by ChEMBL
LigandPNGBDBM50042540(5-Butyl-4-[2'-(1H-tetrazol-5-yl)-biphenyl-4-ylmeth...)
Affinity DataIC50:  2.20E+4nM. Assay description: Inhibition of metallo-beta-lactamase (MBL) from Bacteroides fragilis.
In DepthDetails ArticlePubMed