BDBM50042653 7-[3-Bromo-4,5-bis-(4-fluoro-phenyl)-2-isopropyl-pyrrol-1-yl]-3,5-dihydroxy-hept-6-enoic acid methyl ester::CHEMBL445123
SMILES COC(=O)C[C@H](O)C[C@H](O)\C=C\n1c(C(C)C)c(Br)c(c1-c1ccc(F)cc1)-c1ccc(F)cc1
InChI Key InChIKey=MUTCAPXLKRYEPR-ITWZMISCSA-N
Data  1 IC50
  Tab Delimited (TSV)   2D SDfile   Computed 3D by Vconf -m prep SDfile
Find this compound or compounds like it in BindingDB:
Activity Spreadsheet -- Enzyme Inhibition Constant Data from BindingDB
Found 1 hit for monomerid = 50042653
Target3-hydroxy-3-methylglutaryl-coenzyme A reductase(Rattus norvegicus (rat))
Glaxo Group Research
Curated by ChEMBL
LigandPNGBDBM50042653(7-[3-Bromo-4,5-bis-(4-fluoro-phenyl)-2-isopropyl-p...)
Affinity DataIC50:  0.300nM. Assay description: Inhibition of rat liver microsomal HMG-CoA reductase
In DepthDetails ArticlePubMed