BDBM50042715 1-(5,6-Dihydro-4H-pyrrolo[3,2,1-ij]quinolin-1-yl)-3-(5-methyl-1H-imidazol-4-yl)-propan-1-one::CHEMBL333737
SMILES Cc1nc[nH]c1CCC(=O)c1cn2CCCc3cccc1c23
InChI Key InChIKey=NTUOZYULQWIJLP-UHFFFAOYSA-N
Data  1 KI
  Tab Delimited (TSV)   2D SDfile   Computed 3D by Vconf -m prep SDfile
Find this compound or compounds like it in BindingDB:
Activity Spreadsheet -- Enzyme Inhibition Constant Data from BindingDB
Found 1 hit for monomerid = 50042715
Target5-hydroxytryptamine receptor 3A/3B(Rattus norvegicus)
Solvay Duphar
Curated by ChEMBL
LigandPNGBDBM50042715(1-(5,6-Dihydro-4H-pyrrolo[3,2,1-ij]quinolin-1-yl)-...)
Affinity DataKi:  0.0750nM. Assay description: The binding affinity of the compound was measured on histamine H1 receptor using [3H]- mepyramine as radioligand.
In DepthDetails ArticlePubMed