BDBM50042926 CHEMBL3354565
SMILES CC(=O)Nc1ccc2nc(nc(N3CCOCC3)c2c1)-c1cccc(NS(=O)(=O)c2ccccc2)c1
InChI Key InChIKey=APSUSKFJHUBJPP-UHFFFAOYSA-N
Data  2 IC50
  Tab Delimited (TSV)   2D SDfile   Computed 3D by Vconf -m prep SDfile
Find this compound or compounds like it in BindingDB:
Activity Spreadsheet -- Enzyme Inhibition Constant Data from BindingDB
Found 2 hits for monomerid = 50042926
TargetPhosphatidylinositol 4-phosphate 3-kinase C2 domain-containing subunit beta(Homo sapiens (Human))
Curtin University
Curated by ChEMBL
LigandPNGBDBM50042926(CHEMBL3354565)
Affinity DataIC50:  630nM. Assay description: Inhibition of GST-tagged human recombinant PI3KC2beta expressed in Sf9 cells
In DepthDetails ArticlePubMed
TargetPhosphatidylinositol 4-phosphate 3-kinase C2 domain-containing subunit beta(Homo sapiens (Human))
Curtin University
Curated by ChEMBL
LigandPNGBDBM50042926(CHEMBL3354565)
Affinity DataIC50:  630nM. Assay description: Inhibition of human PI3KC2beta by non-radiometric ADP-Glo assay
In DepthDetails ArticlePubMed