BDBM50042978 (E)-1-(2-hydroxyphenyl)-3-(4-hydroxyphenyl)prop-2-en-1-one::(E)-3-(4-hydroxyphenyl)-1-(2-hydroxyphenyl)-2-propen-1-one::3-(4-Hydroxy-phenyl)-1-(2-hydroxy-phenyl)-propenone::CHEMBL126804::Chalcone 3::US11866416, Compound SN-II-113
SMILES Oc1ccc(\C=C\C(=O)c2ccccc2O)cc1
InChI Key InChIKey=FGPJTMCJNPRZGF-JXMROGBWSA-N
Data  6 IC50
  Tab Delimited (TSV)   2D SDfile   Computed 3D by Vconf -m prep SDfile
Find this compound or compounds like it in BindingDB:
Activity Spreadsheet -- Enzyme Inhibition Constant Data from BindingDB
Found 6 hits for monomerid = 50042978
TargetStromal cell-derived factor 1(Homo sapiens (Human))
UniversitÉ
LigandPNGBDBM50042978((E)-1-(2-hydroxyphenyl)-3-(4-hydroxyphenyl)prop-2-...)
Affinity DataIC50:  2.42E+4nMT: 2°C. Assay description: Binding of chalcone 4 and chlcone 1 to CSCL12 was examined by monitoring changes in the emission intensity of intrinsic Trp fluorescence of the chemo...
In DepthDetails ArticlePubMed
TargetPolyunsaturated fatty acid 5-lipoxygenase(Rattus norvegicus)
Tokushima Bunri University
Curated by ChEMBL
LigandPNGBDBM50042978((E)-1-(2-hydroxyphenyl)-3-(4-hydroxyphenyl)prop-2-...)
Affinity DataIC50:  4.20E+4nM. Assay description: In vitro inhibition against 5-lipoxygenase in RBL-1 cells was determined
In DepthDetails ArticlePubMed
TargetBiofilm regulatory protein A(Streptococcus mutans serotype c (strain ATCC 70061...)
Uab Research Foundation
US Patent
LigandPNGBDBM50042978((E)-1-(2-hydroxyphenyl)-3-(4-hydroxyphenyl)prop-2-...)
Affinity DataIC50:  2.13E+5nM. Assay description: A previously reported zymographic assay was utilized for the investigation of Gtf enzymatic activity, as described in Example 1. A 1:100 in fresh 5 m...
In DepthDetails US Patent
TargetXanthine dehydrogenase/oxidase(Bos taurus (Bovine))
Guangxi Medical University
Curated by ChEMBL
LigandPNGBDBM50042978((E)-1-(2-hydroxyphenyl)-3-(4-hydroxyphenyl)prop-2-...)
Affinity DataIC50:  7.94E+4nM. Assay description: Inhibition of bovine milk xanthine oxidase pre-incubated for 30 mins followed by xanthine addition and measured every 30 secs for 5 mins by spectroph...
In DepthDetails ArticlePubMed
TargetAldo-keto reductase family 1 member B1(Rattus norvegicus)TBA
LigandPNGBDBM50042978((E)-1-(2-hydroxyphenyl)-3-(4-hydroxyphenyl)prop-2-...)
Affinity DataIC50:  4.25E+3nM. Assay description: Inhibition of Rattus norvegicus (rat) lens aldose reductase
In DepthDetails Article
TargetPolyunsaturated fatty acid 5-lipoxygenase(Rattus norvegicus)
Tokushima Bunri University
Curated by ChEMBL
LigandPNGBDBM50042978((E)-1-(2-hydroxyphenyl)-3-(4-hydroxyphenyl)prop-2-...)
Affinity DataIC50:  4.20E+4nM. Assay description: Inhibition of 5-lipoxygenase in rat RBL1 cells
In DepthDetails Article