BDBM50043377 CHEMBL3355060
SMILES NCc1ccc(OCC#Cc2ccc3ccncc3c2)cc1
InChI Key InChIKey=GHTONBRGSYPHCN-UHFFFAOYSA-N
Data  1 IC50
  Tab Delimited (TSV)   2D SDfile   Computed 3D by Vconf -m prep SDfile
Find this compound or compounds like it in BindingDB:
Activity Spreadsheet -- Enzyme Inhibition Constant Data from BindingDB
Found 1 hit for monomerid = 50043377
TargetMaternal embryonic leucine zipper kinase(Homo sapiens (Human))
Astex Pharmaceuticals
Curated by ChEMBL
LigandPNGBDBM50043377(CHEMBL3355060)
Affinity DataIC50:  2.40E+4nM. Assay description: Inhibition of MELK (unknown origin) using Biotin-KKLNRTLSFAEPG substrate by Astex/scintillation counting analysis
In DepthDetails ArticlePubMed