BDBM50043770 CHEMBL3355997
SMILES C1CNC[C@@H](C1)Nc1nccc(n1)-c1cccnc1Oc1ccc(Nc2nc3ccccc3[nH]2)c2ccccc12
InChI Key InChIKey=DSBYFQXQZZQAFZ-HXUWFJFHSA-N
Data  2 IC50
  Tab Delimited (TSV)   2D SDfile   Computed 3D by Vconf -m prep SDfile
Find this compound or compounds like it in BindingDB:
Activity Spreadsheet -- Enzyme Inhibition Constant Data from BindingDB
Found 2 hits for monomerid = 50043770
TargetSerine/threonine-protein kinase/endoribonuclease IRE1(Homo sapiens (Human))
Amgen
Curated by ChEMBL
LigandPNGBDBM50043770(CHEMBL3355997)
Affinity DataIC50:  51nM. Assay description: Inhibition of human IRE1alpha using 5'[6FAM]-GAGUCCGCAGCACUC-[BHQ1]3' substrate by biochemical fluorescence quenching assay
In DepthDetails ArticlePubMed
TargetMitogen-activated protein kinase 10(Homo sapiens (Human))
Amgen
Curated by ChEMBL
LigandPNGBDBM50043770(CHEMBL3355997)
Affinity DataIC50:  14nM. Assay description: Inhibition of human wild type JNK3 using biotinylated ATF2 substrate assessed as phosphorylation at thr53 on ATF2 by fluorescent plate reader
In DepthDetails ArticlePubMed