BDBM50043838 (E)-6-{3-[(4-Chloro-benzenesulfonylamino)-methyl]-phenyl}-6-pyridin-3-yl-hex-5-enoic acid::CHEMBL127683
SMILES OC(=O)CCC\C=C(\c1cccnc1)c1cccc(CNS(=O)(=O)c2ccc(Cl)cc2)c1
InChI Key InChIKey=IEZMFLQSTWTPEP-LIMNOBDPSA-N
Data  2 IC50
  Tab Delimited (TSV)   2D SDfile   Computed 3D by Vconf -m prep SDfile
Find this compound or compounds like it in BindingDB:
Activity Spreadsheet -- Enzyme Inhibition Constant Data from BindingDB
Found 2 hits for monomerid = 50043838
TargetThromboxane A2 receptor(Homo sapiens (Human))
Dr. Karl Thomae
Curated by ChEMBL
LigandPNGBDBM50043838((E)-6-{3-[(4-Chloro-benzenesulfonylamino)-methyl]-...)
Affinity DataIC50:  21nM. Assay description: Displacement of the high affinity radiolabeled ligand [3H]- SQ-29,548 from the PGH-2/TXA-2 receptor in human gel-filtered platelets.
In DepthDetails ArticlePubMed
TargetThromboxane-A synthase(Homo sapiens (Human))
Dr. Karl Thomae
Curated by ChEMBL
LigandPNGBDBM50043838((E)-6-{3-[(4-Chloro-benzenesulfonylamino)-methyl]-...)
Affinity DataIC50:  5nM. Assay description: Inhibition test of thromboxane A2 synthetase in human gel-filtered platelets.
In DepthDetails ArticlePubMed