BDBM50044042 (S)-N-((S)-1-Carbamoyl-2-phenyl-ethyl)-3-[(S)-2-[2-((S)-3,3-dimethyl-butyrylamino)-3-(1H-indol-3-yl)-propionylamino]-6-(3-o-tolyl-ureido)-hexanoylamino]-N-methyl-succinamic acid::CHEMBL319913
SMILES CN([C@@H](Cc1ccccc1)C(N)=O)C(=O)[C@H](CC(O)=O)NC(=O)[C@H](CCCCNC(=O)Nc1ccccc1C)NC(=O)[C@H](Cc1c[nH]c2ccccc12)NC(=O)CC(C)(C)C
InChI Key InChIKey=CITGVGHWOPZVLZ-BQYLNSIHSA-N
Data  2 IC50
  Tab Delimited (TSV)   2D SDfile   Computed 3D by Vconf -m prep SDfile
Find this compound or compounds like it in BindingDB:
Activity Spreadsheet -- Enzyme Inhibition Constant Data from BindingDB
Found 2 hits for monomerid = 50044042
TargetGastrin/cholecystokinin type B receptor(Homo sapiens (Human))
Abbott Laboratories
Curated by ChEMBL
LigandPNGBDBM50044042((S)-N-((S)-1-Carbamoyl-2-phenyl-ethyl)-3-[(S)-2-[2...)
Affinity DataIC50:  5.20E+3nM. Assay description: Concentration required to inhibit 50% of specific binding to Cholecystokinin type B receptor in guinea pig cortex using [125I]Bolton-Hunter CCK-8
In DepthDetails ArticlePubMed
TargetCholecystokinin receptor type A(Cavia porcellus)
Abbott Laboratories
Curated by ChEMBL
LigandPNGBDBM50044042((S)-N-((S)-1-Carbamoyl-2-phenyl-ethyl)-3-[(S)-2-[2...)
Affinity DataIC50:  1.40nM. Assay description: Inhibition of [125I]Bolton-Hunter CCK-8 binding to cholecystokinin type A receptor in guinea pig pancreas
In DepthDetails ArticlePubMed