BDBM50044700 (8-Methyl-2,4-dioxo-1-oxa-3,8-diaza-spiro[4.5]dec-3-yl)-acetic acid methyl ester::CHEMBL76063
SMILES COC(=O)CN1C(=O)OC2(CCN(C)CC2)C1=O
InChI Key InChIKey=JPSFNAICVHINOA-UHFFFAOYSA-N
Data  1 KI
  Tab Delimited (TSV)   2D SDfile   Computed 3D by Vconf -m prep SDfile
Find this compound or compounds like it in BindingDB:
Activity Spreadsheet -- Enzyme Inhibition Constant Data from BindingDB
Found 1 hit for monomerid = 50044700
TargetMuscarinic acetylcholine receptor M1(RAT)
Institute For Drug Discovery Research
Curated by ChEMBL
LigandPNGBDBM50044700((8-Methyl-2,4-dioxo-1-oxa-3,8-diaza-spiro[4.5]dec-...)
Affinity DataKi: >1.00E+4nM. Assay description: Displacement of [3H]pirenzepine from rat cortex membrane expressing muscarinic M1 receptor
In DepthDetails ArticlePubMed