BDBM50044767 CHEMBL75124::Hydroxymethoxybenzyl pelargonamide::N-(4-hydroxy-3-methoxybenzyl)nonanamide::N-Nonanoyl vanillylamide::N-Vanillylnonamide::N-Vanillylpelargonamide::Pelargonyl vanillylamide::Pseudocapsaicin::Vanillyl-N-nonylamide::nonivamide
SMILES CCCCCCCCC(=O)NCc1ccc(O)c(OC)c1
InChI Key InChIKey=RGOVYLWUIBMPGK-UHFFFAOYSA-N
Data  1 KI  3 EC50
  Tab Delimited (TSV)   2D SDfile   Computed 3D by Vconf -m prep SDfile
Find this compound or compounds like it in BindingDB:
Activity Spreadsheet -- Enzyme Inhibition Constant Data from BindingDB
Found 4 hits for monomerid = 50044767
TargetTransient receptor potential cation channel subfamily V member 1(Rattus norvegicus (rat))
Seoul National University
Curated by ChEMBL
LigandPNGBDBM50044767(CHEMBL75124 | Hydroxymethoxybenzyl pelargonamide |...)
Affinity DataKi:  1.22E+3nM. Assay description: Displacement of [3H]RTX from rat TRPV1 expressed in CHO cells
In DepthDetails ArticlePubMed
TargetTransient receptor potential cation channel subfamily V member 1(Rattus norvegicus (rat))
Seoul National University
Curated by ChEMBL
LigandPNGBDBM50044767(CHEMBL75124 | Hydroxymethoxybenzyl pelargonamide |...)
Affinity DataEC50:  223nM. Assay description: Agonist activity at rat TRPV1 expressed in CHO cells assessed as calcium uptake
In DepthDetails ArticlePubMed
TargetTransient receptor potential cation channel subfamily V member 1/2/4(Rattus norvegicus)
Sandoz Institute For Medical Research
Curated by ChEMBL
LigandPNGBDBM50044767(CHEMBL75124 | Hydroxymethoxybenzyl pelargonamide |...)
Affinity DataEC50:  550nM. Assay description: Effective concentration for [Ca2+] uptake into dorsal root ganglia neurones in rat cultured spinal sensory neurones
In DepthDetails ArticlePubMed
TargetTransient receptor potential cation channel subfamily V member 1/2/4(Rattus norvegicus)
Sandoz Institute For Medical Research
Curated by ChEMBL
LigandPNGBDBM50044767(CHEMBL75124 | Hydroxymethoxybenzyl pelargonamide |...)
Affinity DataEC50:  550nM. Assay description: In vitro effective concentration for Ca++ uptake into dorsal root ganglia neurones in culture
In DepthDetails ArticlePubMed