BDBM50044835 CHEMBL3311186
SMILES CCCNc1cc(NC(=O)c2cccnc2)cc(c1)C(F)(F)F
InChI Key InChIKey=BJZUYRRKPINCLY-UHFFFAOYSA-N
Data  1 IC50
  Tab Delimited (TSV)   2D SDfile   Computed 3D by Vconf -m prep SDfile
Find this compound or compounds like it in BindingDB:
Activity Spreadsheet -- Enzyme Inhibition Constant Data from BindingDB
Found 1 hit for monomerid = 50044835
TargetTransient receptor potential cation channel subfamily A member 1(Homo sapiens (Human))
Astrazeneca
Curated by ChEMBL
LigandPNGBDBM50044835(CHEMBL3311186)
Affinity DataIC50:  940nM. Assay description: Antagonist activity at human TRPA1 expressed in HEK293-TREx cells assessed as change in calcium level by Fluo-4NW assay
In DepthDetails ArticlePubMed