BDBM50045272 4-[2-Methyl-4-(2,6,6-trimethyl-cyclohex-1-enyl)-but-1-enyl]-benzoic acid::CHEMBL36718
SMILES C\C(CCC1=C(C)CCCC1(C)C)=C/c1ccc(cc1)C(O)=O
InChI Key InChIKey=BTFYSNDGWSYEGA-CCEZHUSRSA-N
Data  4 EC50
  Tab Delimited (TSV)   2D SDfile   Computed 3D by Vconf -m prep SDfile
Find this compound or compounds like it in BindingDB:
Activity Spreadsheet -- Enzyme Inhibition Constant Data from BindingDB
Found 4 hits for monomerid = 50045272
TargetRetinoic acid receptor beta(Homo sapiens (Human))
Sri International
Curated by ChEMBL
LigandPNGBDBM50045272(4-[2-Methyl-4-(2,6,6-trimethyl-cyclohex-1-enyl)-bu...)
Affinity DataEC50:  20nM. Assay description: Effective concentration against Retinoic acid receptor beta
In DepthDetails ArticlePubMed
TargetRetinoic acid receptor alpha(Homo sapiens (Human))
Sri International
Curated by ChEMBL
LigandPNGBDBM50045272(4-[2-Methyl-4-(2,6,6-trimethyl-cyclohex-1-enyl)-bu...)
Affinity DataEC50:  550nM. Assay description: Effective concentration against RAR-alpha receptor
In DepthDetails ArticlePubMed
TargetRetinoic acid receptor gamma(Homo sapiens (Human))
Sri International
Curated by ChEMBL
LigandPNGBDBM50045272(4-[2-Methyl-4-(2,6,6-trimethyl-cyclohex-1-enyl)-bu...)
Affinity DataEC50:  210nM. Assay description: Effective concentration against RAR-gamma receptor
In DepthDetails ArticlePubMed
TargetRetinoic acid receptor RXR-alpha(Homo sapiens (Human))
Sri International
Curated by ChEMBL
LigandPNGBDBM50045272(4-[2-Methyl-4-(2,6,6-trimethyl-cyclohex-1-enyl)-bu...)
Affinity DataEC50:  1.50E+3nM. Assay description: Effective concentration against RXR-alpha receptor
In DepthDetails ArticlePubMed