BDBM50045539 3Beta,5Alpha,6Beta-Trihydroxycholestanol::CHEBI:28082::CHOLESTAN-3beta,5alpha,6beta-TRIOL
SMILES [H][C@@]1(CC[C@@]2([H])[C@]3([H])C[C@@H](O)[C@@]4(O)C[C@@H](O)CC[C@]4(C)[C@@]3([H])CC[C@]12C)[C@H](C)CCCC(C)C
InChI Key InChIKey=YMMFNKXZULYSOQ-RUXQDQFYSA-N
Data  1 EC50
  Tab Delimited (TSV)   2D SDfile   Computed 3D by Vconf -m prep SDfile
Find this compound or compounds like it in BindingDB:
Activity Spreadsheet -- Enzyme Inhibition Constant Data from BindingDB
Found 1 hit for monomerid = 50045539
TargetNPC1-like intracellular cholesterol transporter 1(Homo sapiens (Human))
The University Of Tokyo
Curated by ChEMBL
LigandPNGBDBM50045539(3Beta,5Alpha,6Beta-Trihydroxycholestanol | CHEBI:2...)
Affinity DataEC50:  1.70E+3nM. Assay description: Binding affinity to FLAG/tGFP-tagged NPC1 I1061T mutant (unknown origin) expressed in HEK293 cells assessed as localization after 24 hrs by fluoresce...
In DepthDetails ArticlePubMed