BDBM50046045 CHEMBL3310138
SMILES Nc1onc(c1-c1ccncn1)-c1ccc(F)cc1
InChI Key InChIKey=BKBYSKGMHADPJD-UHFFFAOYSA-N
Data  4 IC50
  Tab Delimited (TSV)   2D SDfile   Computed 3D by Vconf -m prep SDfile
Find this compound or compounds like it in BindingDB:
Activity Spreadsheet -- Enzyme Inhibition Constant Data from BindingDB
Found 4 hits for monomerid = 50046045
TargetMitogen-activated protein kinase 14(Homo sapiens (Human))
Aska Pharmaceutical
Curated by ChEMBL
LigandPNGBDBM50046045(CHEMBL3310138)
Affinity DataIC50:  792nM. Assay description: Inhibition of full length human p38alpha MAP kinase by Off-chip mobility shift assay
In DepthDetails ArticlePubMed
TargetMitogen-activated protein kinase 10(Homo sapiens (Human))
Aska Pharmaceutical
Curated by ChEMBL
LigandPNGBDBM50046045(CHEMBL3310138)
Affinity DataIC50:  2.20E+3nM. Assay description: Inhibition of human JNK3 kinase by Off-chip mobility shift assay
In DepthDetails ArticlePubMed
TargetMitogen-activated protein kinase 9(Homo sapiens (Human))
Aska Pharmaceutical
Curated by ChEMBL
LigandPNGBDBM50046045(CHEMBL3310138)
Affinity DataIC50:  1.48E+3nM. Assay description: Inhibition of human JNK2 kinase by Off-chip mobility shift assay
In DepthDetails ArticlePubMed
TargetMitogen-activated protein kinase 11(Homo sapiens (Human))
Aska Pharmaceutical
Curated by ChEMBL
LigandPNGBDBM50046045(CHEMBL3310138)
Affinity DataIC50:  9.71E+3nM. Assay description: Inhibition of human p38beta MAP kinase by Off-chip mobility shift assay
In DepthDetails ArticlePubMed