BDBM50046098 CHEMBL3310289
SMILES CCC(O)Cc1cc(cc(c1)C1(CC1)C#N)-c1ccnc2[nH]nc(c12)C(F)(F)F
InChI Key
Data  1 KI
  Tab Delimited (TSV)   2D SDfile   Computed 3D by Vconf -m prep SDfile
Find this compound or compounds like it in BindingDB:
Activity Spreadsheet -- Enzyme Inhibition Constant Data from BindingDB
Found 1 hit for monomerid = 50046098
TargetProtein kinase C epsilon type(Homo sapiens (Human))
Vertex Pharmaceuticals
Curated by ChEMBL
LigandPNGBDBM50046098(CHEMBL3310289)
Affinity DataKi:  49nM. Assay description: Inhibition of full-length recombinant PKCepsilon (unknown origin) using ERMRPRKRQGSVRRRV peptide substrate by coupled-enzyme assay
In DepthDetails ArticlePubMed