BDBM50046212 1,1'-biphenyl-3,3'-dicarboximidamide::CHEMBL150621
SMILES NC(=N)c1cccc(c1)-c1cccc(c1)C(N)=N
InChI Key InChIKey=XTBGVKWFXBUIJD-UHFFFAOYSA-N
Data  1 IC50
  Tab Delimited (TSV)   2D SDfile   Computed 3D by Vconf -m prep SDfile
Find this compound or compounds like it in BindingDB:
Activity Spreadsheet -- Enzyme Inhibition Constant Data from BindingDB
Found 1 hit for monomerid = 50046212
TargetS-adenosylmethionine decarboxylase proenzyme(Rattus norvegicus)
Ciba-Geigy
Curated by ChEMBL
LigandPNGBDBM50046212(1,1'-biphenyl-3,3'-dicarboximidamide | CHEMBL15062...)
Affinity DataIC50:  600nM. Assay description: Inhibitory concentration of compound against S-Adenosylmethionine decarboxylase (SAMDC) from rat liver
In DepthDetails ArticlePubMed