BDBM50046219 2-Amino-7-(4-chloro-benzyl)-3,5-dihydro-pyrrolo[3,2-d]pyrimidin-4-one::CHEMBL79410
SMILES Nc1nc2c(Cc3ccc(Cl)cc3)c[nH]c2c(=O)[nH]1
InChI Key InChIKey=UUGHFFUUNJFXJA-UHFFFAOYSA-N
Data  2 KI  3 IC50
  Tab Delimited (TSV)   2D SDfile   Computed 3D by Vconf -m prep SDfile
Find this compound or compounds like it in BindingDB:
Activity Spreadsheet -- Enzyme Inhibition Constant Data from BindingDB
Found 5 hits for monomerid = 50046219
TargetPurine nucleoside phosphorylase(Bos taurus (bovine))
University Of Michigan
Curated by ChEMBL
LigandPNGBDBM50046219(2-Amino-7-(4-chloro-benzyl)-3,5-dihydro-pyrrolo[3,...)
Affinity DataKi:  3.90nM. Assay description: Inhibitory activity of the compound against calf spleen Purine nucleoside phosphorylase (PNP) using 2-amino-6-mercapto-7-methyl purine ribonucleoside...
In DepthDetails ArticlePubMed
TargetPurine nucleoside phosphorylase(Bos taurus (bovine))
University Of Michigan
Curated by ChEMBL
LigandPNGBDBM50046219(2-Amino-7-(4-chloro-benzyl)-3,5-dihydro-pyrrolo[3,...)
Affinity DataKi:  10.6nM. Assay description: Inhibitory activity against calf spleen purine nucleoside phosphorylase (PNP) using inosine as substrate at a concentration of 10 uM.
In DepthDetails ArticlePubMed
TargetPurine nucleoside phosphorylase(Bos taurus (bovine))
University Of Michigan
Curated by ChEMBL
LigandPNGBDBM50046219(2-Amino-7-(4-chloro-benzyl)-3,5-dihydro-pyrrolo[3,...)
Affinity DataIC50:  25nM. Assay description: Inhibition of purine nucleoside phosphorylase against the enzyme from calf spleen in 1 mM phosphate
In DepthDetails ArticlePubMed
TargetPurine nucleoside phosphorylase(Bos taurus (bovine))
University Of Michigan
Curated by ChEMBL
LigandPNGBDBM50046219(2-Amino-7-(4-chloro-benzyl)-3,5-dihydro-pyrrolo[3,...)
Affinity DataIC50:  380nM. Assay description: Inhibition of Purine nucleoside phosphorylase was evaluated against the enzyme from calf spleen in 50 mM phosphate
In DepthDetails ArticlePubMed
TargetPurine nucleoside phosphorylase(Bos taurus (bovine))
University Of Michigan
Curated by ChEMBL
LigandPNGBDBM50046219(2-Amino-7-(4-chloro-benzyl)-3,5-dihydro-pyrrolo[3,...)
Affinity DataIC50:  17.4nM. Assay description: Inhibitory activity against calf spleen purine nucleoside phosphorylase (PNP) using inosine as substrate at a concentration of 10 uM.
In DepthDetails ArticlePubMed