BDBM50046315 2-Amino-3-(4-benzyloxy-phenyl)-1-(4-trifluoromethyl-phenyl)-propan-1-one::CHEMBL302371
SMILES N[C@@H](Cc1ccc(OCc2ccccc2)cc1)C(=O)c1ccc(cc1)C(F)(F)F
InChI Key InChIKey=MFWZRUBWKSVEMR-NRFANRHFSA-N
Data  1 IC50
  Tab Delimited (TSV)   2D SDfile   Computed 3D by Vconf -m prep SDfile
Find this compound or compounds like it in BindingDB:
Activity Spreadsheet -- Enzyme Inhibition Constant Data from BindingDB
Found 1 hit for monomerid = 50046315
TargetLeukotriene A-4 hydrolase(Homo sapiens (Human))
Scripps Research Institute
Curated by ChEMBL
LigandPNGBDBM50046315(2-Amino-3-(4-benzyloxy-phenyl)-1-(4-trifluoromethy...)
Affinity DataIC50:  1.00E+4nM. Assay description: Inhibition of amidase activity of LTA4 hydrolase purified from human leukocytes
In DepthDetails ArticlePubMed