BDBM50046395 CHEMBL3314410
SMILES CC(C(=O)NCc1ccc(nc1C1=CCC(C)(C)CC1)C(F)(F)F)c1ccc(NS(C)(=O)=O)c(F)c1
InChI Key InChIKey=RNWBHMUNVIJXRO-UHFFFAOYSA-N
Data  1 KI
  Tab Delimited (TSV)   2D SDfile   Computed 3D by Vconf -m prep SDfile
Find this compound or compounds like it in BindingDB:
Activity Spreadsheet -- Enzyme Inhibition Constant Data from BindingDB
Found 1 hit for monomerid = 50046395
TargetTransient receptor potential cation channel subfamily V member 1(Homo sapiens (Human))
Seoul National University
Curated by ChEMBL
LigandPNGBDBM50046395(CHEMBL3314410)
Affinity DataKi:  0.200nM. Assay description: Antagonist activity at human TRPV1 expressed in CHO cells assessed as inhibition of capsaicin-induced increase in intracellular Ca2+ level by FLIPR a...
In DepthDetails ArticlePubMed