BDBM50046766 CHEMBL139751::Pentylamino-acetonitrile
SMILES CCCCCNCC#N
InChI Key InChIKey=UYSWGJRTNAKZIE-UHFFFAOYSA-N
Data  2 KI
  Tab Delimited (TSV)   2D SDfile   Computed 3D by Vconf -m prep SDfile
Find this compound or compounds like it in BindingDB:
Activity Spreadsheet -- Enzyme Inhibition Constant Data from BindingDB
Found 2 hits for monomerid = 50046766
TargetAmine oxidase [flavin-containing] B(Bos taurus)
Northwestern University
Curated by ChEMBL
LigandPNGBDBM50046766(CHEMBL139751 | Pentylamino-acetonitrile)
Affinity DataKi:  4.94E+6nM. Assay description: Kinetic constant was calculated by inhibition of monoamino oxidase B (MAO B)
In DepthDetails ArticlePubMed
TargetAmine oxidase [flavin-containing] B(Bos taurus)
Northwestern University
Curated by ChEMBL
LigandPNGBDBM50046766(CHEMBL139751 | Pentylamino-acetonitrile)
Affinity DataKi:  1.40E+7nM. Assay description: Kinetic constant (KI) was calculated by inhibition of monoamino oxidase B (MAO B)
In DepthDetails ArticlePubMed