BDBM50046880 CHEMBL3319246
SMILES Clc1cc(Cl)cc(NC(=O)c2ccc3[nH]ncc3c2)c1
InChI Key InChIKey=XXLZLPDHTLLSMN-UHFFFAOYSA-N
Data  4 IC50
  Tab Delimited (TSV)   2D SDfile   Computed 3D by Vconf -m prep SDfile
Find this compound or compounds like it in BindingDB:
Activity Spreadsheet -- Enzyme Inhibition Constant Data from BindingDB
Found 4 hits for monomerid = 50046880
TargetAmine oxidase [flavin-containing] A(Homo sapiens (Human))
University Of Bonn
Curated by ChEMBL
LigandPNGBDBM50046880(CHEMBL3319246)
Affinity DataIC50: >1.00E+4nM. Assay description: Inhibition of human recombinant MAO-A expressed in baculovirus-infected insect cells using p-tyraimne substrate
In DepthDetails ArticlePubMed
TargetAmine oxidase [flavin-containing] A(Rattus norvegicus (rat))
University Of Bonn
Curated by ChEMBL
LigandPNGBDBM50046880(CHEMBL3319246)
Affinity DataIC50: >1.00E+4nM. Assay description: Inhibition of rat recombinant MAO-A expressed in baculovirus-infected insect cells using p-tyraimne substrate
In DepthDetails ArticlePubMed
TargetAmine oxidase [flavin-containing] B(Homo sapiens (Human))
University Of Bonn
Curated by ChEMBL
LigandPNGBDBM50046880(CHEMBL3319246)
Affinity DataIC50:  2.80nM. Assay description: Inhibition of human recombinant MAO-B expressed in baculovirus-infected insect cells using p-tyraimne substrate
In DepthDetails ArticlePubMed
TargetAmine oxidase [flavin-containing] B(Rattus norvegicus (rat))
University Of Bonn
Curated by ChEMBL
LigandPNGBDBM50046880(CHEMBL3319246)
Affinity DataIC50:  2.70nM. Assay description: Inhibition of rat recombinant MAO-B expressed in baculovirus-infected insect cells using p-tyraimne substrate
In DepthDetails ArticlePubMed