BDBM50047083 4-[5-Chloro-1-(4-methoxy-benzyl)-1H-benzoimidazol-2-yl]-3,3-dimethyl-butyric acid::CHEMBL418552
SMILES COc1ccc(Cn2c(CC(C)(C)CC(O)=O)nc3cc(Cl)ccc23)cc1
InChI Key InChIKey=MCBGUYYBZSTRGI-UHFFFAOYSA-N
Data  1 KI
  Tab Delimited (TSV)   2D SDfile   Computed 3D by Vconf -m prep SDfile
Find this compound or compounds like it in BindingDB:
Activity Spreadsheet -- Enzyme Inhibition Constant Data from BindingDB
Found 1 hit for monomerid = 50047083
TargetThromboxane A2 receptor(Homo sapiens (Human))
Carpibem
Curated by ChEMBL
LigandPNGBDBM50047083(4-[5-Chloro-1-(4-methoxy-benzyl)-1H-benzoimidazol-...)
Affinity DataKi:  20nM. Assay description: Tested in vitro for inhibition constant against TXA2 / PGH-2 receptor using [125I]-PTA-OH binding affinity to human platelets
In DepthDetails ArticlePubMed