BDBM50047132 2,6-Diethyl-3-iodo-4-[2'-(2H-tetrazol-5-yl)-biphenyl-4-ylmethoxy]-pyridine::CHEMBL285560::i2,6-Diethyl-3-iodo-4-[2'-(1H-tetrazol-5-yl)-biphenyl-4-ylmethoxy]-pyridine
SMILES CCc1cc(OCc2ccc(cc2)-c2ccccc2-c2nnn[nH]2)c(I)c(CC)n1
InChI Key InChIKey=CJOUEUPOWAKVHI-UHFFFAOYSA-N
Data  2 IC50
  Tab Delimited (TSV)   2D SDfile   Computed 3D by Vconf -m prep SDfile
Find this compound or compounds like it in BindingDB:
Activity Spreadsheet -- Enzyme Inhibition Constant Data from BindingDB
Found 2 hits for monomerid = 50047132
TargetType-1/Type-2 angiotensin II receptor(Homo sapiens (Human))TBA
LigandPNGBDBM50047132(2,6-Diethyl-3-iodo-4-[2'-(2H-tetrazol-5-yl)-biphen...)
Affinity DataIC50:  14nM. Assay description: Inhibition of [125I]AII binding to guinea pig adrenal membrane
In DepthDetails Article
TargetType-1 angiotensin II receptor(Cavia porcellus)
Zeneca Pharmaceuticals
Curated by ChEMBL
LigandPNGBDBM50047132(2,6-Diethyl-3-iodo-4-[2'-(2H-tetrazol-5-yl)-biphen...)
Affinity DataIC50:  14nM. Assay description: Inhibition of [125I]-Angiotensin binding to a guinea pig adrenal membrane preparation which corresponds to Angiotensin II receptor, type 1
In DepthDetails ArticlePubMed