BDBM50047268 3-(2-{3-[4-(4-Cyclohexylcarbamoyl-butylcarbamoyl)-oxazol-2-yl]-7-oxa-bicyclo[2.2.1]hept-2-ylmethyl}-phenyl)-propionic acid::CHEMBL30377
SMILES OC(=O)CCc1ccccc1CC1C2CCC(O2)C1c1nc(co1)C(=O)NCCCCC(=O)NC1CCCCC1
InChI Key InChIKey=WELWIILLEUCEMX-UHFFFAOYSA-N
Data  1 Kd
  Tab Delimited (TSV)   2D SDfile   Computed 3D by Vconf -m prep SDfile
Find this compound or compounds like it in BindingDB:
Activity Spreadsheet -- Enzyme Inhibition Constant Data from BindingDB
Found 1 hit for monomerid = 50047268
TargetThromboxane A2 receptor(Homo sapiens (Human))
Bristol-Myers Squibb Pharmaceutical Research Institute
Curated by ChEMBL
LigandPNGBDBM50047268(3-(2-{3-[4-(4-Cyclohexylcarbamoyl-butylcarbamoyl)-...)
Affinity DataKd:  22nM. Assay description: Inhibitory binding activity against TXA2 receptor in human platelet membrane, using [3H]-SQ 29548 as the radioligand
In DepthDetails ArticlePubMed