BDBM50047340 CHEMBL3314584
SMILES CO[C@H]1CN(CC[C@H]1NC(=O)c1[nH]c(C)c(Cl)c1Cl)c1nc(-c2ccn[nH]2)c(s1)C(O)=O
InChI Key
Data  2 IC50
  Tab Delimited (TSV)   2D SDfile   Computed 3D by Vconf -m prep SDfile
Find this compound or compounds like it in BindingDB:
Activity Spreadsheet -- Enzyme Inhibition Constant Data from BindingDB
Found 2 hits for monomerid = 50047340
TargetToxin ParE(Escherichia coli)
Astrazeneca
Curated by ChEMBL
LigandPNGBDBM50047340(CHEMBL3314584)
Affinity DataIC50:  87nM. Assay description: Inhibition of ATPase activity of Escherichia coli ParE
In DepthDetails ArticlePubMed
TargetDNA gyrase subunit B(Staphylococcus aureus)
Astrazeneca
Curated by ChEMBL
LigandPNGBDBM50047340(CHEMBL3314584)
Affinity DataIC50: <10nM. Assay description: Inhibition of ATPase activity of Staphylococcus aureus GyrB
In DepthDetails ArticlePubMed