BDBM50047572 3-Methyl-N-[2-(5-methyl-4-phenyl-imidazol-1-yl)-ethyl]-2-(3-pentyl-ureido)-benzamide::CHEMBL43908
SMILES CCCCCNC(=O)Nc1c(C)cccc1C(=O)NCCn1cnc(c1C)-c1ccccc1
InChI Key InChIKey=UPFLNSFJZFPMHI-UHFFFAOYSA-N
Data  2 IC50
  Tab Delimited (TSV)   2D SDfile   Computed 3D by Vconf -m prep SDfile
Find this compound or compounds like it in BindingDB:
Activity Spreadsheet -- Enzyme Inhibition Constant Data from BindingDB
Found 2 hits for monomerid = 50047572
TargetAcyl-CoA:cholesterol acyltransferase(Oryctolagus cuniculus)
Eisai
Curated by ChEMBL
LigandPNGBDBM50047572(3-Methyl-N-[2-(5-methyl-4-phenyl-imidazol-1-yl)-et...)
Affinity DataIC50:  280nM. Assay description: Inhibition against acyl coenzyme A:cholesterol acyltransferase derived from rabbit aorta homogenate
In DepthDetails ArticlePubMed
TargetAcyl-CoA:cholesterol acyltransferase(Oryctolagus cuniculus)
Eisai
Curated by ChEMBL
LigandPNGBDBM50047572(3-Methyl-N-[2-(5-methyl-4-phenyl-imidazol-1-yl)-et...)
Affinity DataIC50:  97nM. Assay description: Inhibition against acyl coenzyme A:cholesterol acyltransferase derived from rabbit intestine microsomes
In DepthDetails ArticlePubMed