BDBM50048076 4-[2-Butyl-5-((E)-2-carboxy-3-thiophen-2-yl-propenyl)-imidazol-1-ylmethyl]-2,5-dichloro-benzoic acid::4-[2-Butyl-5-(2-carboxy-3-thiophen-2-yl-propenyl)-imidazol-1-ylmethyl]-2,5-dichloro-benzoic acid::CHEMBL56574
SMILES CCCCc1ncc(\C=C(/Cc2cccs2)C(O)=O)n1Cc1cc(Cl)c(cc1Cl)C(O)=O
InChI Key InChIKey=IKQPALGLFOYRMI-RIYZIHGNSA-N
Data  2 IC50
  Tab Delimited (TSV)   2D SDfile   Computed 3D by Vconf -m prep SDfile
Find this compound or compounds like it in BindingDB:
Activity Spreadsheet -- Enzyme Inhibition Constant Data from BindingDB
Found 2 hits for monomerid = 50048076
LigandPNGBDBM50048076(4-[2-Butyl-5-((E)-2-carboxy-3-thiophen-2-yl-propen...)
Affinity DataIC50:  35nM. Assay description: Inhibition of [125I]AII binding to Angiotensin II receptor, type 1 of rat mesenteric arteries
In DepthDetails ArticlePubMed
LigandPNGBDBM50048076(4-[2-Butyl-5-((E)-2-carboxy-3-thiophen-2-yl-propen...)
Affinity DataIC50:  35nM. Assay description: Tested for inhibition of [125I]- AII specific binding to rat mesenteric arteries, expressed as IC50
In DepthDetails Article