BDBM50048077 CHEMBL3357470
SMILES [N-]=[N+]=NCc1ccc(cc1)C(=O)N[C@@H](Cc1ccccc1)C(=O)NCC#N
InChI Key InChIKey=DVKMARVBVWAAJU-KRWDZBQOSA-N
Data  1 IC50
  Tab Delimited (TSV)   2D SDfile   Computed 3D by Vconf -m prep SDfile
Find this compound or compounds like it in BindingDB:
Activity Spreadsheet -- Enzyme Inhibition Constant Data from BindingDB
Found 1 hit for monomerid = 50048077
TargetPapain(Carica papaya)
Radboud University Nijmegen
Curated by ChEMBL
LigandPNGBDBM50048077(CHEMBL3357470)
Affinity DataIC50:  270nM. Assay description: Inhibition of papaya papain using Z-Phe-Arg-pNA substrate by spectrophotometry
In DepthDetails ArticlePubMed