BDBM50048617 CHEMBL3319623
SMILES OC(=O)CN(Cc1cccc(Oc2ccccc2)c1)S(=O)(=O)c1ccc(Cl)cc1
InChI Key InChIKey=CKWAGXVZXQSEHH-UHFFFAOYSA-N
Data  1 IC50
  Tab Delimited (TSV)   2D SDfile   Computed 3D by Vconf -m prep SDfile
Find this compound or compounds like it in BindingDB:
Activity Spreadsheet -- Enzyme Inhibition Constant Data from BindingDB
Found 1 hit for monomerid = 50048617
TargetDiacylglycerol lipase-alpha(Homo sapiens (Human))
Leiden University
Curated by ChEMBL
LigandPNGBDBM50048617(CHEMBL3319623)
Affinity DataIC50:  91nM. Assay description: Inhibition of human DAGLalpha expressed in HEK293T cell membranes
In DepthDetails ArticlePubMed