BDBM50048927 6-Heptyl-4-methyl-4H-[1,2,5]thiadiazolo[3,4-d]pyrimidine-5,7-dione::CHEMBL174254
SMILES CCCCCCCn1c(=O)n(C)c2nsnc2c1=O
InChI Key InChIKey=UDRIBVJSKTWRAU-UHFFFAOYSA-N
Data  1 IC50
  Tab Delimited (TSV)   2D SDfile   Computed 3D by Vconf -m prep SDfile
Find this compound or compounds like it in BindingDB:
Activity Spreadsheet -- Enzyme Inhibition Constant Data from BindingDB
Found 1 hit for monomerid = 50048927
TargetTumor necrosis factor(Homo sapiens (Human))
University Of California
Curated by ChEMBL
LigandPNGBDBM50048927(6-Heptyl-4-methyl-4H-[1,2,5]thiadiazolo[3,4-d]pyri...)
Affinity DataIC50:  7.50E+4nM. Assay description: TNF-alpha production in PBMC by ELISA method
In DepthDetails ArticlePubMed