BDBM50048937 4-(3,7-Dimethyl-2,6-dioxo-2,3,6,7-tetrahydro-purin-1-ylmethyl)-benzoic acid methyl ester::CHEMBL354263
SMILES COC(=O)c1ccc(Cn2c(=O)n(C)c3ncn(C)c3c2=O)cc1
InChI Key InChIKey=DWSNDHBPYVVGPX-UHFFFAOYSA-N
Data  1 IC50
  Tab Delimited (TSV)   2D SDfile   Computed 3D by Vconf -m prep SDfile
Find this compound or compounds like it in BindingDB:
Activity Spreadsheet -- Enzyme Inhibition Constant Data from BindingDB
Found 1 hit for monomerid = 50048937
TargetTumor necrosis factor(Homo sapiens (Human))
University Of California
Curated by ChEMBL
LigandPNGBDBM50048937(4-(3,7-Dimethyl-2,6-dioxo-2,3,6,7-tetrahydro-purin...)
Affinity DataIC50: >2.00E+5nM. Assay description: TNF-alpha production in PBMC by ELISA method
In DepthDetails ArticlePubMed