BDBM50048947 4-(2,4-Dioxo-1-propyl-1,4-dihydro-2H-pteridin-3-yl)-butyric acid::CHEMBL172224
SMILES CCCn1c2nccnc2c(=O)n(CCCC(O)=O)c1=O
InChI Key InChIKey=NZBUNBBZLHKYLF-UHFFFAOYSA-N
Data  1 IC50
  Tab Delimited (TSV)   2D SDfile   Computed 3D by Vconf -m prep SDfile
Find this compound or compounds like it in BindingDB:
Activity Spreadsheet -- Enzyme Inhibition Constant Data from BindingDB
Found 1 hit for monomerid = 50048947
TargetTumor necrosis factor(Homo sapiens (Human))
University Of California
Curated by ChEMBL
LigandPNGBDBM50048947(4-(2,4-Dioxo-1-propyl-1,4-dihydro-2H-pteridin-3-yl...)
Affinity DataIC50: >2.00E+5nM. Assay description: TNF-alpha production in PBMC by ELISA method
In DepthDetails ArticlePubMed