BDBM50049184 2-Butyl-3-[2'-(1H-tetrazol-5-yl)-biphenyl-4-ylmethyl]-3H-imidazo[4,5-b]pyridine::CHEMBL158725::FK-739
SMILES CCCCc1nc2cccnc2n1Cc1ccc(cc1)-c1ccccc1-c1nnn[nH]1
InChI Key InChIKey=YILJWHUIUCRKEU-UHFFFAOYSA-N
Data  1 Kd
  Tab Delimited (TSV)   2D SDfile   Computed 3D by Vconf -m prep SDfile
Find this compound or compounds like it in BindingDB:
Activity Spreadsheet -- Enzyme Inhibition Constant Data from BindingDB
Found 1 hit for monomerid = 50049184
TargetType-1 angiotensin II receptor(RABBIT)
The M. S. University Of Baroda
Curated by ChEMBL
LigandPNGBDBM50049184(2-Butyl-3-[2'-(1H-tetrazol-5-yl)-biphenyl-4-ylmeth...)
Affinity DataKd:  3.55nM. Assay description: Antagonist activity at angiotensin AT1 receptor in rabbit aorta
In DepthDetails ArticlePubMed