BDBM50049671 2-Methyl-6-(5-methyl-[1,3,4]oxadiazol-2-yl)-10,10-dioxo-10H-10lambda*6*-thioxanthen-9-one::CHEMBL292927
SMILES Cc1nnc(o1)-c1ccc2C(=O)c3cc(C)ccc3S(=O)(=O)c2c1
InChI Key InChIKey=WTXDEEQYRFOWRV-UHFFFAOYSA-N
Data  1 IC50
  Tab Delimited (TSV)   2D SDfile   Computed 3D by Vconf -m prep SDfile
Find this compound or compounds like it in BindingDB:
Activity Spreadsheet -- Enzyme Inhibition Constant Data from BindingDB
Found 1 hit for monomerid = 50049671
TargetAmine oxidase [flavin-containing] A(Rattus norvegicus (rat))
Wellcome Research Laboratories
Curated by ChEMBL
LigandPNGBDBM50049671(2-Methyl-6-(5-methyl-[1,3,4]oxadiazol-2-yl)-10,10-...)
Affinity DataIC50:  2nM. Assay description: Inhibitory concentration against rat brain mitochondrial monoamine oxidase A
In DepthDetails ArticlePubMed