BDBM50049789 1-((R)-5-Cyclohexyl-1-methyl-2-oxo-2,3-dihydro-1H-benzo[e][1,4]diazepin-3-yl)-3-[3-(1H-tetrazol-5-ylamino)-phenyl]-urea::CHEMBL168263
SMILES CN1c2ccccc2C(=N[C@@H](NC(=O)Nc2cccc(Nc3nnn[nH]3)c2)C1=O)C1CCCCC1
InChI Key InChIKey=BXVUQKOBEMWXPX-NRFANRHFSA-N
Data  2 IC50
  Tab Delimited (TSV)   2D SDfile   Computed 3D by Vconf -m prep SDfile
Find this compound or compounds like it in BindingDB:
Activity Spreadsheet -- Enzyme Inhibition Constant Data from BindingDB
Found 2 hits for monomerid = 50049789
TargetCholecystokinin receptor type A(RAT)
Neuroscience Research Centre
Curated by ChEMBL
LigandPNGBDBM50049789(1-((R)-5-Cyclohexyl-1-methyl-2-oxo-2,3-dihydro-1H-...)
Affinity DataIC50:  200nM. Assay description: Inhibition of [125 I]BH CCK-8S binding to Cholecystokinin type A receptor in pancreatic tissue
In DepthDetails ArticlePubMed
TargetGastrin/cholecystokinin type B receptor(Homo sapiens (Human))
Neuroscience Research Centre
Curated by ChEMBL
LigandPNGBDBM50049789(1-((R)-5-Cyclohexyl-1-methyl-2-oxo-2,3-dihydro-1H-...)
Affinity DataIC50:  0.200nM. Assay description: Inhibition of [125 I]BH CCK-8S binding to Cholecystokinin type B receptor in guinea pig cortical membranes
In DepthDetails ArticlePubMed