BDBM50050701 CHEMBL3317986
SMILES CN(C)C(=O)N[C@@H]1CCC[C@@H](C1)Nc1nc(ncc1F)-c1c[nH]c2ncc(F)cc12
InChI Key InChIKey=FQFBFOCKLOCPEH-QWHCGFSZSA-N
Data  1 Kd
  Tab Delimited (TSV)   2D SDfile   Computed 3D by Vconf -m prep SDfile
Find this compound or compounds like it in BindingDB:
Activity Spreadsheet -- Enzyme Inhibition Constant Data from BindingDB
Found 1 hit for monomerid = 50050701
TargetPolymerase basic protein 2(Influenza A virus (strain A/Puerto Rico/8/1934 H1N...)
Vertex Pharmaceuticals
Curated by ChEMBL
LigandPNGBDBM50050701(CHEMBL3317986)
Affinity DataKd:  400nM. Assay description: Binding affinity to influenza A virus (A/Puerto Rico/8/1934(H1N1)) PB2 by competition binding fluorescence polarization (FP) assay
In DepthDetails ArticlePubMed