BDBM50051087 CHEMBL3318146
SMILES [H][C@]12CSSC[C@]3([H])NC(=O)[C@@]([H])(NC(=O)[C@H](Cc4c[nH]c5ccccc45)NC(=O)[C@H](CCSC)NC(=O)[C@H](Cc4c[nH]c5ccccc45)NC(=O)[C@H](CCCCN)NC(=O)[C@H](CCC(N)=O)NC(=O)[C@H](CSSC[C@]([H])(NC(=O)[C@]([H])(CSSC[C@H](NC(=O)[C@H](Cc4c[nH]c5ccccc45)NC(=O)[C@H](CC(C)C)NC(=O)[C@H](CCCNC(N)=N)NC1=O)C(=O)N[C@@H](CCCCN)C(=O)N[C@@H](CCCCN)C(=O)N[C@@H](CCCCN)C(=O)N(C)[C@@H](CC(C)C)C(=O)N[C@@H]([C@@H](C)CC)C(O)=O)NC(=O)[C@H](CCCCN)NC(=O)[C@H](CCCNC(N)=N)NC(=O)[C@H](C)NC(=O)[C@H](CO)NC(=O)[C@H](CC(O)=O)NC3=O)C(=O)N[C@@H](CCC(O)=O)C(=O)NCC(=O)N[C@@H](CC(C)C)C(=O)N[C@@H](C(C)C)C(=O)N2)NC(=O)[C@@H](N)Cc1ccc(O)cc1)[C@@H](C)O
InChI Key
Data  2 IC50
  Tab Delimited (TSV)   2D SDfile   Computed 3D by Vconf -m prep SDfile
Find this compound or compounds like it in BindingDB:
Activity Spreadsheet -- Enzyme Inhibition Constant Data from BindingDB
Found 2 hits for monomerid = 50051087
TargetSodium channel protein type 2 subunit alpha(Rattus norvegicus)
Purdue Pharma
Curated by ChEMBL
LigandPNGBDBM50051087(CHEMBL3318146)
Affinity DataIC50:  138nM. Assay description: Inhibition of rat Nav1.7 expressed in HEK-293 cells at -130 to -110 mV holding potential by whole-cell voltage clamp analysis
In DepthDetails ArticlePubMed
TargetSodium channel protein type 9 subunit alpha(Homo sapiens (Human))
Purdue Pharma
Curated by ChEMBL
LigandPNGBDBM50051087(CHEMBL3318146)
Affinity DataIC50:  528nM. Assay description: Inhibition of human Nav1.7 expressed in HEK-293 cells at -130 to -110 mV holding potential by whole-cell voltage clamp analysis
In DepthDetails ArticlePubMed